Target
Bromodomain-containing protein 4
Ligand
BDBM50276660
Substrate
Meas. Tech.
ChEMBL_1715829 (CHEMBL4130829)
IC50
>1000±n/a nM
Citation
 Hu, JWang, YLi, YXu, LCao, DSong, SDamaneh, MSWang, XMeng, TChen, YLShen, JMiao, ZXiong, B Discovery of a series of dihydroquinoxalin-2(1H)-ones as selective BET inhibitors from a dual PLK1-BRD4 inhibitor. Eur J Med Chem 137:176-195 (2017)  
Target
Name:
Bromodomain-containing protein 4
Synonyms:
BRD4 Bromodomain-containing protein 4 (BRD4) Protein HUNK1
Type:
Protein
Mol. Mass.:
152264.84
Organism:
Homo sapiens (Human)
Description:
O60885
Residue:
1362
  
Inhibitor
Name:
BDBM50276660
Synonyms:
CHEMBL4174264
Type:
Small organic molecule
Emp. Form.:
C21H25N3O3S
Mol. Mass.:
399.507
SMILES:
CC1N(C2CCCC2)c2cc(NS(=O)(=O)c3ccc(C)cc3)ccc2NC1=O
: