Target
Estrogen receptor
Ligand
BDBM20607
Substrate
Meas. Tech.
ChEMBL_1719003 (CHEMBL4134003)
IC50
2670±n/a nM
Citation
 Luo, GLi, XZhang, GWu, CTang, ZLiu, LYou, QXiang, H Novel SERMs based on 3-aryl-4-aryloxy-2H-chromen-2-one skeleton - A possible way to dual ER?/VEGFR-2 ligands for treatment of breast cancer. Eur J Med Chem 140:252-273 (2017)  
Target
Name:
Estrogen receptor
Synonyms:
ER ESR ESR1_HUMAN Estrogen receptor Estrogen receptor (ER-alpha) Estrogen receptor alpha (ER) Nuclear receptor subfamily 3 group A member 1
Type:
Protein
Mol. Mass.:
66230.44
Organism:
Homo sapiens (Human)
Description:
P03372
Residue:
595
  
Inhibitor
Name:
BDBM20607
Synonyms:
(2-{4-[(1Z)-1,2-diphenylbut-1-en-1-yl]phenoxy}ethyl)dimethylamine CHEMBL83 NCGC00024928 Tamoxifen Tamoxifen, 7 med.21724, Compound Tamoxifen
Type:
Small organic molecule
Emp. Form.:
C26H29NO
Mol. Mass.:
371.5146
SMILES:
CC\C(=C(/c1ccccc1)c1ccc(OCCN(C)C)cc1)c1ccccc1
: