Target
Cysteinyl leukotriene receptor 1
Ligand
BDBM50015551
Substrate
Meas. Tech.
ChEBML_52357
Ki
0.800000±n/a nM
Citation
 Matassa, VGMaduskuie, TPShapiro, HSHesp, BSnyder, DWAharony, DKrell, RDKeith, RA Evolution of a series of peptidoleukotriene antagonists: synthesis and structure/activity relationships of 1,3,5-substituted indoles and indazoles. J Med Chem 33:1781-90 (1990)  
Target
Name:
Cysteinyl leukotriene receptor 1
Synonyms:
CLTR1_CAVPO | CYSLTR1
Type:
Enzyme Catalytic Domain
Mol. Mass.:
39007.58
Organism:
GUINEA PIG
Description:
Leukotriene D4 0 GUINEA PIG::Q2NNR5
Residue:
340
  
Inhibitor
Name:
BDBM50015551
Synonyms:
CHEMBL301498 | N-{4-[5-(3-Cyclopentyl-ureido)-1-methyl-1H-indol-3-ylmethyl]-3-methoxy-benzoyl}-benzenesulfonamide
Type:
Small organic molecule
Emp. Form.:
C30H32N4O5S
Mol. Mass.:
560.664
SMILES:
COc1cc(ccc1Cc1cn(C)c2ccc(NC(=O)NC3CCCC3)cc12)C(=O)NS(=O)(=O)c1ccccc1
: