Target
Cysteinyl leukotriene receptor 1/2
Ligand
BDBM50227356
Substrate
Meas. Tech.
ChEMBL_52226 (CHEMBL666490)
Ki
0.300000±n/a nM
Citation
 Matassa, VGMaduskuie, TPShapiro, HSHesp, BSnyder, DWAharony, DKrell, RDKeith, RA Evolution of a series of peptidoleukotriene antagonists: synthesis and structure/activity relationships of 1,3,5-substituted indoles and indazoles. J Med Chem 33:1781-90 (1990)  
Target
Name:
Cysteinyl leukotriene receptor 1/2
Synonyms:
Cysteinyl leukotriene receptor
Type:
Mol. Mass.:
Description:
ASSAY_ID of ChEMBL is 98640
Components:
This complex has 2 components.
Component 1
Name:
Cysteinyl leukotriene receptor 1
Synonyms:
CLTR1_HUMAN CYSLTR1 Cysteinyl leukotriene receptor HG55 LTD4 receptor | Leukotriene Cysteinyl 1
Type:
Enzyme Catalytic Domain
Mol. Mass.:
38565.16
Organism:
Homo sapiens (Human)
Description:
Leukotriene Cysteinyl 1 CYSLTR1 HUMAN::Q9Y271
Residue:
337
  
Component 2
Name:
Cysteinyl leukotriene receptor 2
Synonyms:
CLTR2_HUMAN CYSLT2R Cysteinyl leukotriene receptor Leukotriene Cysteinyl 2
Type:
Enzyme Catalytic Domain
Mol. Mass.:
39657.52
Organism:
Homo sapiens (Human)
Description:
Leukotriene Cysteinyl 2 CYSLTR2 HUMAN::Q9NS75
Residue:
346
  
Inhibitor
Name:
BDBM50227356
Synonyms:
CHEMBL49944
Type:
Small organic molecule
Emp. Form.:
C29H29ClN4O6S
Mol. Mass.:
597.082
SMILES:
COc1cc(ccc1Cc1nn(C)c2ccc(NC(=O)OC3CCCC3)cc12)C(=O)NS(=O)(=O)c1ccccc1Cl
: