Target
Cystathionine gamma-lyase
Ligand
BDBM50279935
Substrate
Meas. Tech.
ChEBML_1721616
IC50
2100±n/a nM
Citation
 Bhattacharjee, ASinha, ARatia, KYin, LDelgado-Rivera, LPetukhov, PAThatcher, GRJWardrop, DJ 2-Arylidene Hydrazinecarbodithioates as Potent, Selective Inhibitors of Cystathionine ?-Lyase (CSE). ACS Med Chem Lett 8:1241-1245 (2017)  
Target
Name:
Cystathionine gamma-lyase
Synonyms:
CGL_HUMAN Cystathionine gamma-lyase (CSE) Gamma-cystathionase
Type:
Protein
Mol. Mass.:
44509.52
Organism:
Homo sapiens (Human)
Description:
P32929
Residue:
405
  
Inhibitor
Name:
BDBM50279935
Synonyms:
CHEMBL4168463
Type:
Small organic molecule
Emp. Form.:
C14H14N4O2S3
Mol. Mass.:
366.482
SMILES:
COc1ccc(NC(=O)CSC(=S)N\N=C\c2cscn2)cc1
: