Target
Cystathionine gamma-lyase
Ligand
BDBM50279940
Substrate
Meas. Tech.
ChEBML_1721616
IC50
6000±n/a nM
Citation
 Bhattacharjee, ASinha, ARatia, KYin, LDelgado-Rivera, LPetukhov, PAThatcher, GRJWardrop, DJ 2-Arylidene Hydrazinecarbodithioates as Potent, Selective Inhibitors of Cystathionine ?-Lyase (CSE). ACS Med Chem Lett 8:1241-1245 (2017)  
Target
Name:
Cystathionine gamma-lyase
Synonyms:
CGL_HUMAN Cystathionine gamma-lyase (CSE) Gamma-cystathionase
Type:
Protein
Mol. Mass.:
44509.52
Organism:
Homo sapiens (Human)
Description:
P32929
Residue:
405
  
Inhibitor
Name:
BDBM50279940
Synonyms:
CHEMBL4159463
Type:
Small organic molecule
Emp. Form.:
C20H24N4OS2
Mol. Mass.:
400.561
SMILES:
Cc1cccc(\C=N\NC(=S)SCC(=O)Nc2ccc(cc2)C(C)(C)C)n1
: