Target
Cystathionine gamma-lyase
Ligand
BDBM50279975
Substrate
Meas. Tech.
ChEBML_1721616
IC50
5000±n/a nM
Citation
 Bhattacharjee, ASinha, ARatia, KYin, LDelgado-Rivera, LPetukhov, PAThatcher, GRJWardrop, DJ 2-Arylidene Hydrazinecarbodithioates as Potent, Selective Inhibitors of Cystathionine ?-Lyase (CSE). ACS Med Chem Lett 8:1241-1245 (2017)  
Target
Name:
Cystathionine gamma-lyase
Synonyms:
CGL_HUMAN Cystathionine gamma-lyase (CSE) Gamma-cystathionase
Type:
Protein
Mol. Mass.:
44509.52
Organism:
Homo sapiens (Human)
Description:
P32929
Residue:
405
  
Inhibitor
Name:
BDBM50279975
Synonyms:
CHEMBL4170257
Type:
Small organic molecule
Emp. Form.:
C9H11N3S2
Mol. Mass.:
225.334
SMILES:
CSC(=S)N\N=C\c1cccc(C)n1
: