Target
Cystathionine gamma-lyase
Ligand
BDBM50280014
Substrate
Meas. Tech.
ChEBML_1721616
IC50
2000±n/a nM
Citation
 Bhattacharjee, ASinha, ARatia, KYin, LDelgado-Rivera, LPetukhov, PAThatcher, GRJWardrop, DJ 2-Arylidene Hydrazinecarbodithioates as Potent, Selective Inhibitors of Cystathionine ?-Lyase (CSE). ACS Med Chem Lett 8:1241-1245 (2017)  
Target
Name:
Cystathionine gamma-lyase
Synonyms:
CGL_HUMAN Cystathionine gamma-lyase (CSE) Gamma-cystathionase
Type:
Protein
Mol. Mass.:
44509.52
Organism:
Homo sapiens (Human)
Description:
P32929
Residue:
405
  
Inhibitor
Name:
BDBM50280014
Synonyms:
CHEMBL4160453
Type:
Small organic molecule
Emp. Form.:
C16H15FN4OS2
Mol. Mass.:
362.445
SMILES:
Cc1ccc(NC(=O)CSC(=S)N\N=C\c2ncccc2F)cc1
: