Target
Toll-like receptor 8
Ligand
BDBM50279620
Substrate
Meas. Tech.
ChEMBL_1721302 (CHEMBL4136302)
EC50
3850±n/a nM
Citation
 Larson, PKucaba, TAXiong, ZOlin, MGriffith, TSFerguson, DM Design and Synthesis of N1-Modified Imidazoquinoline Agonists for Selective Activation of Toll-like Receptors 7 and 8. ACS Med Chem Lett 8:1148-1152 (2017)  
Target
Name:
Toll-like receptor 8
Synonyms:
CD_antigen: CD288 TLR8_HUMAN | TRL8
Type:
Enzyme
Mol. Mass.:
119828.77
Organism:
Homo sapiens (Human)
Description:
Q9NR97
Residue:
1041
  
Inhibitor
Name:
BDBM50279620
Synonyms:
CHEMBL4162585
Type:
Small organic molecule
Emp. Form.:
C20H27N5O2
Mol. Mass.:
369.4607
SMILES:
CCCCc1nc2c(N)nc3cc(ccc3c2n1CCCCN)C(=O)OC
: