Target
Mu-type opioid receptor
Ligand
BDBM50279647
Substrate
Meas. Tech.
ChEMBL_1721377 (CHEMBL4136377)
IC50
1.8±n/a nM
Citation
 Van der Poorten, OVan Den Hauwe, REiselt, EBetti, CGuillemyn, KChung, NNHallé, FBihel, FSchiller, PWTourwé, DSarret, PGendron, LBallet, S ?-Space Screening of Dermorphin-Based Tetrapeptides through Use of Constrained Arylazepinone and Quinolinone Scaffolds. ACS Med Chem Lett 8:1177-1182 (2017)  
Target
Name:
Mu-type opioid receptor
Synonyms:
M-OR-1 Mor OPRM_MOUSE Oprm | Oprm1
Type:
Enzyme Catalytic Domain
Mol. Mass.:
44431.62
Organism:
MOUSE
Description:
OPIATE Mu OPRM1 MOUSE::P42866
Residue:
398
  
Inhibitor
Name:
BDBM50279647
Synonyms:
CHEMBL4169811
Type:
Small organic molecule
Emp. Form.:
C30H35N5O5
Mol. Mass.:
545.6294
SMILES:
C[C@@H](NC(=O)[C@@H](N)Cc1c(C)cc(O)cc1C)C(=O)N[C@H]1Cc2ccc3ccccc3c2CN(CC(N)=O)C1=O
: