Target
Carbonic anhydrase
Ligand
BDBM10880
Substrate
Meas. Tech.
ChEMBL_1721406 (CHEMBL4136406)
Ki
11±n/a nM
Citation
 Nocentini, ACadoni, RDel Prete, SCapasso, CDumy, PGratteri, PSupuran, CTWinum, JY Benzoxaboroles as Efficient Inhibitors of the ?-Carbonic Anhydrases from Pathogenic Fungi: Activity and Modeling Study. ACS Med Chem Lett 8:1194-1198 (2017)  
Target
Name:
Carbonic anhydrase
Synonyms:
Type:
PROTEIN
Mol. Mass.:
24709.64
Organism:
Candida glabrata
Description:
ChEMBL_584597
Residue:
219
  
Inhibitor
Name:
BDBM10880
Synonyms:
AZA AZM acetazolamide Acetazolamide Acetazolamide (AZA) Acetazolamide, 5 Acetazolamide, AZA CHEMBL20 Sulfonamide, 1 US11278534, Example acetazolamide sulfonamide 1
Type:
Small organic molecule
Emp. Form.:
C4H6N4O3S2
Mol. Mass.:
222.245
SMILES:
CC(=O)Nc1nnc(s1)S(N)(=O)=O
: