Target
Protein kinase C epsilon type
Ligand
BDBM50244451
Substrate
Meas. Tech.
ChEMBL_1722135 (CHEMBL4137135)
Ki
42±n/a nM
Citation
 Ann, JCzikora, ASaini, ASZhou, XMitchell, GALewin, NEPeach, MLBlumberg, PMLee, J ?-Arylidene Diacylglycerol-Lactones (DAG-Lactones) as Selective Ras Guanine-Releasing Protein 3 (RasGRP3) Ligands. J Med Chem 61:6261-6276 (2018)  
Target
Name:
Protein kinase C epsilon type
Synonyms:
KPCE_HUMAN PKCE Protein kinase C epsilon Protein kinase C, PKC; classical/novel nPKC-epsilon
Type:
Enzyme
Mol. Mass.:
83680.45
Organism:
Homo sapiens (Human)
Description:
The recombinant human PKC enzymes were produced using a baculovirus expression system in SF9 cells
Residue:
737
  
Inhibitor
Name:
BDBM50244451
Synonyms:
(E)-(2-(hydroxymethyl)-4-((1-methyl-1H-indol-3-yl)methylene)-5-oxo-tetrahydrofuran-2-yl)methyl 2-isobutyl-4-methylpentanoate | CHEMBL488667
Type:
Small organic molecule
Emp. Form.:
C26H35NO5
Mol. Mass.:
441.5598
SMILES:
CC(C)CC(CC(C)C)C(=O)OCC1(CO)C\C(=C/c2cn(C)c3ccccc23)C(=O)O1
: