Target
Protein kinase C epsilon type
Ligand
BDBM50280765
Substrate
Meas. Tech.
ChEMBL_1722135 (CHEMBL4137135)
Ki
39±n/a nM
Citation
 Ann, JCzikora, ASaini, ASZhou, XMitchell, GALewin, NEPeach, MLBlumberg, PMLee, J ?-Arylidene Diacylglycerol-Lactones (DAG-Lactones) as Selective Ras Guanine-Releasing Protein 3 (RasGRP3) Ligands. J Med Chem 61:6261-6276 (2018)  
Target
Name:
Protein kinase C epsilon type
Synonyms:
KPCE_HUMAN PKCE Protein kinase C epsilon Protein kinase C, PKC; classical/novel nPKC-epsilon
Type:
Enzyme
Mol. Mass.:
83680.45
Organism:
Homo sapiens (Human)
Description:
The recombinant human PKC enzymes were produced using a baculovirus expression system in SF9 cells
Residue:
737
  
Inhibitor
Name:
BDBM50280765
Synonyms:
CHEMBL4160647
Type:
Small organic molecule
Emp. Form.:
C21H24ClNO5
Mol. Mass.:
405.872
SMILES:
Cn1cc(\C=C2/CC(CO)(COC(=O)C(C)(C)C)OC2=O)c2cc(Cl)ccc12
: