Target
Renin
Ligand
BDBM50016037
Substrate
Meas. Tech.
ChEBML_192730
IC50
630±n/a nM
Citation
 Kaltenbronn, JSHudspeth, JPLunney, EAMichniewicz, BMNicolaides, EDRepine, JTRoarK, WHStier, MATinney, FJWoo, PK Renin inhibitors containing isosteric replacements of the amide bond connecting the P3 and P2 sites. J Med Chem 33:838-45 (1990)  
Target
Name:
Renin
Synonyms:
Angiotensinogenase RENI_HUMAN
Type:
Enzyme
Mol. Mass.:
45058.99
Organism:
Homo sapiens (Human)
Description:
Residue:
406
  
Inhibitor
Name:
BDBM50016037
Synonyms:
(4-{3-[1-(3-Aminomethyl-benzylcarbamoyl)-3-methyl-butylcarbamoyl]-1-cyclohexylmethyl-2-hydroxy-propylcarbamoyl}-1-benzyl-butyl)-carbamic acid tert-butyl ester : (0.6 chloroform) | CHEMBL352450
Type:
Small organic molecule
Emp. Form.:
C42H65N5O6
Mol. Mass.:
735.9954
SMILES:
CC(C)C[C@H](NC(=O)C[C@@H](O)C(CC1CCCCC1)NC(=O)CCC[C@H](Cc1ccccc1)NC(=O)OC(C)(C)C)C(=O)NCc1cccc(CN)c1
: