Target
Aldo-keto reductase family 1 member B1
Ligand
BDBM50009982
Substrate
Meas. Tech.
ChEMBL_32073 (CHEMBL645984)
IC50
40000±n/a nM
Citation
 DeRuiter, JSwearingen, BEWandrekar, VMayfield, CA Synthesis and in vitro aldose reductase inhibitory activity of compounds containing an N-acylglycine moiety. J Med Chem 32:1033-8 (1989)  
Target
Name:
Aldo-keto reductase family 1 member B1
Synonyms:
ALDR_RAT Akr1b4 Aldr1
Type:
PROTEIN
Mol. Mass.:
35797.87
Organism:
Rattus norvegicus
Description:
ChEMBL_1512484
Residue:
316
  
Inhibitor
Name:
BDBM50009982
Synonyms:
CHEMBL8798 | [(Naphthalene-2-carbonyl)-amino]-acetic acid
Type:
Small organic molecule
Emp. Form.:
C13H11NO3
Mol. Mass.:
229.2313
SMILES:
OC(=O)CNC(=O)c1ccc2ccccc2c1
: