Target
D(1A) dopamine receptor
Ligand
BDBM21397
Substrate
Meas. Tech.
ChEMBL_58673 (CHEMBL670447)
Ki
>3000±n/a nM
Citation
 Chumpradit, SKung, HFBillings, JKung, MPPan, S (+/-)-7-chloro-8-hydroxy-1-(4'-[125I]iodophenyl)-3-methyl-2,3,4,5- tetrahydro-1H-3-benzazepine: a potential CNS D-1 dopamine receptor imaging agent. J Med Chem 32:1431-5 (1989)  
Target
Name:
D(1A) dopamine receptor
Synonyms:
DOPAMINE D1 Dopamine D1 high Dopamine receptor Dopamine1-like Drd1a
Type:
Enzyme Catalytic Domain
Mol. Mass.:
49429.75
Organism:
RAT
Description:
P18901
Residue:
446
  
Inhibitor
Name:
BDBM21397
Synonyms:
8-[4-(4-fluorophenyl)-4-keto-butyl]-1-phenyl-1,3,8-triazaspiro[4.5]decan-4-one 8-[4-(4-fluorophenyl)-4-oxobutyl]-1-phenyl-1,3,8-triazaspiro[4.5]decan-4-one MLS000028615 SPIPERONE US9359372, Spiperone cid_5265
Type:
radiolabeled ligand
Emp. Form.:
C23H26FN3O2
Mol. Mass.:
395.4698
SMILES:
Fc1ccc(cc1)C(=O)CCCN1CCC2(CC1)N(CNC2=O)c1ccccc1
: