Target
Beta-2 adrenergic receptor
Ligand
BDBM50292219
Substrate
Meas. Tech.
ChEMBL_1729837 (CHEMBL4145115)
Ki
0.208930±n/a nM
Citation
 Nocentini, ACeruso, MBua, SLomelino, CLAndring, JTMcKenna, RLanzi, CSgambellone, SPecori, RMatucci, RFilippi, LGratteri, PCarta, FMasini, ESelleri, SSupuran, CT Discovery of ?-Adrenergic Receptors Blocker-Carbonic Anhydrase Inhibitor Hybrids for Multitargeted Antiglaucoma Therapy. J Med Chem 61:5380-5394 (2018)  
Target
Name:
Beta-2 adrenergic receptor
Synonyms:
ADRB2 ADRB2_HUMAN Beta-2 adrenoceptor | Beta-2 adrenoreceptor
Type:
Mol. Mass.:
46461.69
Organism:
Homo sapiens (Human)
Description:
P07550
Residue:
413
  
Inhibitor
Name:
BDBM50292219
Synonyms:
(-)-3-morpholino-4-(3-tert-butylamino-2-hydroxypropoxy)-1,2,5-thiadiazole (2S)-1-(tert-butylamino)-3-[(4-morpholin-4-yl-1,2,5-thiadiazol-3-yl)oxy]propan-2-ol (S)-1-(tert-butylamino)-3-((4-morpholino-1,2,5-thiadiazol-3-yl)oxy)propan-2-ol CHEMBL499 TIMOLOL
Type:
Small organic molecule
Emp. Form.:
C13H24N4O3S
Mol. Mass.:
316.42
SMILES:
CC(C)(C)NC[C@H](O)COc1nsnc1N1CCOCC1
: