Target
Bile acid receptor
Ligand
BDBM21680
Substrate
Meas. Tech.
ChEMBL_1730648 (CHEMBL4146184)
EC50
45000±n/a nM
Citation
 Mostarda, SPasseri, DCarotti, ACerra, BColliva, CBenicchi, TMacchiarulo, APellicciari, RGioiello, A Synthesis, physicochemical properties, and biological activity of bile acids 3-glucuronides: Novel insights into bile acid signalling and detoxification. Eur J Med Chem 144:349-358 (2018)  
Target
Name:
Bile acid receptor
Synonyms:
BAR FXR HRR1 NR1H4_HUMAN RIP14 Retinoid X receptor-interacting protein 14 | farnesoid x receptor
Type:
Nuclear Receptor
Mol. Mass.:
55916.24
Organism:
Homo sapiens (Human)
Description:
Q96RI1
Residue:
486
  
Inhibitor
Name:
BDBM21680
Synonyms:
(4R)-4-[(1S,2S,5R,7S,9R,10R,11S,14R,15R,16S)-5,9,16-trihydroxy-2,15-dimethyltetracyclo[8.7.0.0^{2,7}.0^{11,15}]heptadecan-14-yl]pentanoic acid 3alpha,7alpha,12alpha-trihydroxy-5beta-cholan-24-oic acid CHEMBL205596 Cholate cholicacid
Type:
Steroid
Emp. Form.:
C24H40O5
Mol. Mass.:
408.5714
SMILES:
[H][C@@]1(CC[C@@]2([H])[C@]3([H])[C@H](O)C[C@]4([H])C[C@H](O)CC[C@]4(C)[C@@]3([H])C[C@H](O)[C@]12C)[C@H](C)CCC(O)=O
: