Target
Alpha-galactosidase A
Ligand
BDBM50290907
Substrate
Meas. Tech.
ChEMBL_1730813 (CHEMBL4146349)
IC50
3100±n/a nM
Citation
 Li, HYLee, JDChen, CWSun, YCCheng, WC Synthesis of (3S,4S,5S)-trihydroxylpiperidine derivatives as enzyme stabilizers to improve therapeutic enzyme activity in Fabry patient cell lines. Eur J Med Chem 144:626-634 (2018)  
Target
Name:
Alpha-galactosidase A
Synonyms:
AGAL_HUMAN Alpha-D-galactoside galactohydrolase Alpha-glucosidase A (α-Gal A) INN=Agalsidase | Melibiase
Type:
Protein
Mol. Mass.:
48760.21
Organism:
Homo sapiens (Human)
Description:
Residue:
429
  
Inhibitor
Name:
BDBM50290907
Synonyms:
CHEMBL4175528
Type:
Small organic molecule
Emp. Form.:
C17H32N2O4
Mol. Mass.:
328.447
SMILES:
O[C@H]1CN[C@H](CNC(=O)CCCCC2CCCCC2)[C@H](O)[C@@H]1O
: