Target
Neuraminidase
Ligand
BDBM50294191
Substrate
Meas. Tech.
ChEMBL_1731957 (CHEMBL4147493)
IC50
2510±n/a nM
Citation
 Ju, HZhang, JSun, ZHuang, ZQi, WHuang, BZhan, PLiu, X Discovery of C-1 modified oseltamivir derivatives as potent influenza neuraminidase inhibitors. Eur J Med Chem 146:220-231 (2018)  
Target
Name:
Neuraminidase
Synonyms:
NA | NRAM_I33A0
Type:
PROTEIN
Mol. Mass.:
49687.56
Organism:
Influenza A virus
Description:
ChEMBL_1347422
Residue:
453
  
Inhibitor
Name:
BDBM50294191
Synonyms:
CHEMBL4176592
Type:
Small organic molecule
Emp. Form.:
C23H34FN3O3
Mol. Mass.:
419.5328
SMILES:
CCC(CC)O[C@@H]1C=C(C[C@H](N)[C@H]1NC(C)=O)C(=O)N(C)CCc1cccc(F)c1
: