Target
Neuraminidase
Ligand
BDBM50294194
Substrate
Meas. Tech.
ChEMBL_1731956 (CHEMBL4147492)
IC50
960±n/a nM
Citation
 Ju, HZhang, JSun, ZHuang, ZQi, WHuang, BZhan, PLiu, X Discovery of C-1 modified oseltamivir derivatives as potent influenza neuraminidase inhibitors. Eur J Med Chem 146:220-231 (2018)  
Target
Name:
Neuraminidase
Synonyms:
NA | NRAM_I33A0
Type:
PROTEIN
Mol. Mass.:
49687.56
Organism:
Influenza A virus
Description:
ChEMBL_1347422
Residue:
453
  
Inhibitor
Name:
BDBM50294194
Synonyms:
CHEMBL4169387
Type:
Small organic molecule
Emp. Form.:
C27H35N3O3
Mol. Mass.:
449.5851
SMILES:
CCC(CC)O[C@@H]1C=C(C[C@H](N)[C@H]1NC(C)=O)C(=O)NCc1ccc(cc1)-c1ccccc1
: