Target
Neuraminidase
Ligand
BDBM50295068
Substrate
Meas. Tech.
ChEMBL_1731956 (CHEMBL4147492)
IC50
1348±n/a nM
Citation
 Ju, HZhang, JSun, ZHuang, ZQi, WHuang, BZhan, PLiu, X Discovery of C-1 modified oseltamivir derivatives as potent influenza neuraminidase inhibitors. Eur J Med Chem 146:220-231 (2018)  
Target
Name:
Neuraminidase
Synonyms:
NA | NRAM_I33A0
Type:
PROTEIN
Mol. Mass.:
49687.56
Organism:
Influenza A virus
Description:
ChEMBL_1347422
Residue:
453
  
Inhibitor
Name:
BDBM50295068
Synonyms:
CHEMBL4164459
Type:
Small organic molecule
Emp. Form.:
C17H29N3O5
Mol. Mass.:
355.4293
SMILES:
CCC(CC)O[C@@H]1C=C(C[C@H](N)[C@H]1NC(C)=O)C(=O)N[C@H](C)C(O)=O
: