Target
Neuraminidase
Ligand
BDBM4994
Substrate
Meas. Tech.
ChEMBL_1731956 (CHEMBL4147492)
IC50
23±n/a nM
Citation
 Ju, HZhang, JSun, ZHuang, ZQi, WHuang, BZhan, PLiu, X Discovery of C-1 modified oseltamivir derivatives as potent influenza neuraminidase inhibitors. Eur J Med Chem 146:220-231 (2018)  
Target
Name:
Neuraminidase
Synonyms:
NA | NRAM_I33A0
Type:
PROTEIN
Mol. Mass.:
49687.56
Organism:
Influenza A virus
Description:
ChEMBL_1347422
Residue:
453
  
Inhibitor
Name:
BDBM4994
Synonyms:
(3R,4R,5S)-5-amino-4-acetamido-3-(pentan-3-yloxy)cyclohex-1-ene-1-carboxylic acid GS4071 | Oseltamivir carboxylate
Type:
Small organic molecule
Emp. Form.:
C14H24N2O4
Mol. Mass.:
284.3514
SMILES:
CCC(CC)O[C@@H]1C=C(C[C@H](N)[C@H]1NC(C)=O)C(O)=O
: