Target
Carbonic anhydrase 12
Ligand
BDBM50297923
Substrate
Meas. Tech.
ChEMBL_1732179 (CHEMBL4147715)
Ki
5.6±n/a nM
Citation
 Bonardi, AFalsini, MCatarzi, DVarano, FDi Cesare Mannelli, LTenci, BGhelardini, CAngeli, ASupuran, CTColotta, V Structural investigations on coumarins leading to chromeno[4,3-c]pyrazol-4-ones and pyrano[4,3-c]pyrazol-4-ones: New scaffolds for the design of the tumor-associated carbonic anhydrase isoforms IX and XII. Eur J Med Chem 146:47-59 (2018)  
Target
Name:
Carbonic anhydrase 12
Synonyms:
CA-XII CAH12_HUMAN Carbonic anhydrase Carbonic anhydrase XII Carbonic anhydrase XII (CAXII) | Tumor antigen HOM-RCC-3.1.3
Type:
Enzyme
Mol. Mass.:
39456.00
Organism:
Homo sapiens (Human)
Description:
Catalytic domain of human cloned isozyme was used in the assay
Residue:
354
  
Inhibitor
Name:
BDBM50297923
Synonyms:
CHEMBL4176119
Type:
Small organic molecule
Emp. Form.:
C11H7BrO4
Mol. Mass.:
283.075
SMILES:
CC(=O)c1c(O)c2cc(Br)ccc2oc1=O
: