Target
Mu-type opioid receptor
Ligand
BDBM50008984
Substrate
Meas. Tech.
ChEBML_146550
Ki
2.2±n/a nM
Citation
 Bagley, JRWynn, RLRudo, FGDoorley, BMSpencer, HKSpaulding, T New 4-(heteroanilido)piperidines, structurally related to the pure opioid agonist fentanyl, with agonist and/or antagonist properties. J Med Chem 32:663-71 (1989)  
Target
Name:
Mu-type opioid receptor
Synonyms:
MOR-1 Mu-type opioid receptor (MOR) OPRM_RAT Opioid receptor B Ror-b
Type:
G Protein-Coupled Receptor (GPCR)
Mol. Mass.:
44503.11
Organism:
Rattus norvegicus (rat)
Description:
Competition binding assays were carried out using membrane preparations from transfected HN9.10 cells that constitutively expressed the mu opioid receptor.
Residue:
398
  
Inhibitor
Name:
BDBM50008984
Synonyms:
4-(4-Chloro-benzyl)-2-(1-methyl-azepan-4-yl)-2H-phthalazin-1-one Duragesic-100 Duragesic-25 Duragesic-75 FENTANYL CITRATE Fentanyl-100 Fentanyl-25 Fentanyl-75 Innovar N-(1-Phenethyl-piperidin-4-yl)-N-phenyl-propionamide N-(1-phenethylpiperidin-4-yl)-N-phenylpropionamide | US20230399418, Compound Fentanyl
Type:
Small organic molecule
Emp. Form.:
C22H28N2O
Mol. Mass.:
336.4705
SMILES:
CCC(=O)N(C1CCN(CCc2ccccc2)CC1)c1ccccc1
: