Target
5-hydroxytryptamine receptor 1B
Ligand
BDBM50001898
Substrate
Meas. Tech.
ChEBML_1795
Ki
63±n/a nM
Citation
 Martin, GEElgin, RJMathiasen, JRDavis, CBKesslick, JMBaldy, WJShank, RPDiStefano, DLFedde, CLScott, MK Activity of aromatic substituted phenylpiperazines lacking affinity for dopamine binding sites in a preclinical test of antipsychotic efficacy. J Med Chem 32:1052-6 (1989)  
Target
Name:
5-hydroxytryptamine receptor 1B
Synonyms:
5-HT-1B 5-hydroxytryptamine receptor 1B (5HT1B) 5ht1b Serotonin 1 (5-HT1) receptor Serotonin receptor 1B
Type:
Protein
Mol. Mass.:
43173.33
Organism:
Rattus norvegicus (Rat)
Description:
P28564
Residue:
386
  
Inhibitor
Name:
BDBM50001898
Synonyms:
1-Phenyl-piperazine PHENYLPIPERAZINE
Type:
Small organic molecule
Emp. Form.:
C10H14N2
Mol. Mass.:
162.2316
SMILES:
C1CN(CCN1)c1ccccc1
: