Target
5-hydroxytryptamine receptor 1A
Ligand
BDBM50017450
Substrate
Meas. Tech.
ChEBML_1108
Ki
13±n/a nM
Citation
 Martin, GEElgin, RJMathiasen, JRDavis, CBKesslick, JMBaldy, WJShank, RPDiStefano, DLFedde, CLScott, MK Activity of aromatic substituted phenylpiperazines lacking affinity for dopamine binding sites in a preclinical test of antipsychotic efficacy. J Med Chem 32:1052-6 (1989)  
Target
Name:
5-hydroxytryptamine receptor 1A
Synonyms:
5-HT-1A 5-HT1A 5-hydroxytryptamine receptor 1A (5HT1A) 5ht1a Htr1a Serotonin 1a (5-HT1a) receptor/Adrenergic receptor alpha-1 | Serotonin receptor 1A
Type:
G Protein-Coupled Receptor (GPCR)
Mol. Mass.:
46445.29
Organism:
Rattus norvegicus (rat)
Description:
Binding assays were performed using rat hippocampal membranes.
Residue:
422
  
Inhibitor
Name:
BDBM50017450
Synonyms:
1-(2-Isopropyl-phenyl)-piperazine | CHEMBL276156
Type:
Small organic molecule
Emp. Form.:
C13H20N2
Mol. Mass.:
204.3113
SMILES:
CC(C)c1ccccc1N1CCNCC1
: