Target
5-hydroxytryptamine receptor 1B
Ligand
BDBM50017455
Substrate
Meas. Tech.
ChEBML_1795
Ki
31±n/a nM
Citation
 Martin, GEElgin, RJMathiasen, JRDavis, CBKesslick, JMBaldy, WJShank, RPDiStefano, DLFedde, CLScott, MK Activity of aromatic substituted phenylpiperazines lacking affinity for dopamine binding sites in a preclinical test of antipsychotic efficacy. J Med Chem 32:1052-6 (1989)  
Target
Name:
5-hydroxytryptamine receptor 1B
Synonyms:
5-HT-1B 5-hydroxytryptamine receptor 1B (5HT1B) 5ht1b Serotonin 1 (5-HT1) receptor Serotonin receptor 1B
Type:
Protein
Mol. Mass.:
43173.33
Organism:
Rattus norvegicus (Rat)
Description:
P28564
Residue:
386
  
Inhibitor
Name:
BDBM50017455
Synonyms:
1-(3-Fluoro-phenyl)-piperazine | CHEMBL269784
Type:
Small organic molecule
Emp. Form.:
C10H13FN2
Mol. Mass.:
180.222
SMILES:
Fc1cccc(c1)N1CCNCC1
: