Target
Cyclin-dependent kinase 19
Ligand
BDBM50353060
Substrate
Meas. Tech.
ChEMBL_1734994 (CHEMBL4150530)
IC50
8.0±n/a nM
Citation
 Hatcher, JMWang, ESJohannessen, LKwiatkowski, NSim, TGray, NS Development of Highly Potent and Selective Steroidal Inhibitors and Degraders of CDK8. ACS Med Chem Lett 9:540-545 (2018)  
Target
Name:
Cyclin-dependent kinase 19
Synonyms:
CDC2-related protein kinase 6 CDK11 CDK19_HUMAN Cell division protein kinase 19 Death-preventing kinase | KIAA1028
Type:
Serine/Threonine protein kinase
Mol. Mass.:
56816.68
Organism:
Homo sapiens (Human)
Description:
Q9BWU1
Residue:
502
  
Inhibitor
Name:
BDBM50353060
Synonyms:
CHEMBL4167193
Type:
Small organic molecule
Emp. Form.:
C30H40N2
Mol. Mass.:
428.652
SMILES:
[H][C@@]12CC[C@H](c3ccc4ccncc4c3)[C@@]1(C)CC[C@@]1([H])[C@@]2([H])CC=C2C[C@H](CC[C@]12C)N(C)C
: