Target
Cyclin-dependent kinase 8
Ligand
BDBM50353060
Substrate
Meas. Tech.
ChEMBL_1734990 (CHEMBL4150526)
IC50
16±n/a nM
Citation
 Hatcher, JMWang, ESJohannessen, LKwiatkowski, NSim, TGray, NS Development of Highly Potent and Selective Steroidal Inhibitors and Degraders of CDK8. ACS Med Chem Lett 9:540-545 (2018)  
Target
Name:
Cyclin-dependent kinase 8
Synonyms:
CDK8 Cell division protein kinase 8 Mediator complex subunit CDK8 Protein kinase K35
Type:
Serine/threonine-protein kinase
Mol. Mass.:
53300.21
Organism:
Homo sapiens (Human)
Description:
P49336
Residue:
464
  
Inhibitor
Name:
BDBM50353060
Synonyms:
CHEMBL4167193
Type:
Small organic molecule
Emp. Form.:
C30H40N2
Mol. Mass.:
428.652
SMILES:
[H][C@@]12CC[C@H](c3ccc4ccncc4c3)[C@@]1(C)CC[C@@]1([H])[C@@]2([H])CC=C2C[C@H](CC[C@]12C)N(C)C
: