Target
Cholecystokinin receptor type A
Ligand
BDBM50005459
Substrate
Meas. Tech.
ChEMBL_49576 (CHEMBL661830)
IC50
66±n/a nM
Citation
 Kerwin, JFNadzan, AMKopecka, HLin, CWMiller, TWitte, DBurt, S Hybrid cholecystokinin (CCK) antagonists: new implications in the design and modification of CCK antagonists. J Med Chem 32:739-42 (1989)  
Target
Name:
Cholecystokinin receptor type A
Synonyms:
CCK-A receptor CCK1-R CCKAR_CAVPO Cholecystokinin receptor type A | Cholecystokinin-1 receptor
Type:
Mol. Mass.:
48229.77
Organism:
Cavia porcellus
Description:
Residue:
430
  
Inhibitor
Name:
BDBM50005459
Synonyms:
4-(3,4-Dichloro-benzoylamino)-4-dipentylcarbamoyl-butyric acid CR 1409
Type:
Small organic molecule
Emp. Form.:
C22H32Cl2N2O4
Mol. Mass.:
459.406
SMILES:
CCCCCN(CCCCC)C(=O)[C@@H](CCC(O)=O)NC(=O)c1ccc(Cl)c(Cl)c1
: