Target
Dihydrofolate reductase
Ligand
BDBM50017876
Substrate
Meas. Tech.
ChEBML_55290
Ki
3.9±n/a nM
Citation
 Jones, TRThornton, TJFlinn, AJackman, ALNewell, DRCalvert, AH Quinazoline antifolates inhibiting thymidylate synthase: 2-desamino derivatives with enhanced solubility and potency. J Med Chem 32:847-52 (1989)  
Target
Name:
Dihydrofolate reductase
Synonyms:
DYR_RAT Dihydrofolate reductase (DHFR) Tetrahydrofolate dehydrogenase
Type:
Enzyme
Mol. Mass.:
21638.84
Organism:
Rattus norvegicus (rat)
Description:
Residue:
187
  
Inhibitor
Name:
BDBM50017876
Synonyms:
2-{4-[(2-Amino-4-oxo-3,4-dihydro-quinazolin-6-ylmethyl)-ethyl-amino]-benzoylamino}-pentanedioic acid | CHEMBL22632
Type:
Small organic molecule
Emp. Form.:
C23H25N5O6
Mol. Mass.:
467.4745
SMILES:
CCN(Cc1ccc2nc(N)[nH]c(=O)c2c1)c1ccc(cc1)C(=O)NC(CCC(O)=O)C(O)=O
: