Target
Progesterone receptor
Ligand
BDBM18627
Substrate
Meas. Tech.
ChEMBL_1735709 (CHEMBL4151245)
IC50
0.300000±n/a nM
Citation
 Nishiyama, YMori, SMakishima, MFujii, SKagechika, HHashimoto, YIshikawa, M Novel Nonsteroidal Progesterone Receptor (PR) Antagonists with a Phenanthridinone Skeleton. ACS Med Chem Lett 9:641-645 (2018)  
Target
Name:
Progesterone receptor
Synonyms:
NR3C3 PGR PRGR_HUMAN | progesterone
Type:
Protein
Mol. Mass.:
98979.52
Organism:
Homo sapiens (Human)
Description:
P06401
Residue:
933
  
Inhibitor
Name:
BDBM18627
Synonyms:
(10S,11S,14S,15S,17R)-17-[4-(dimethylamino)phenyl]-14-hydroxy-15-methyl-14-(prop-1-yn-1-yl)tetracyclo[8.7.0.0^{2,7}.0^{11,15}]heptadeca-1,6-dien-5-one Mifepristone RU486 (tetramethyl-rhodamine conjugated)
Type:
Small organic molecule
Emp. Form.:
C29H35NO2
Mol. Mass.:
429.5937
SMILES:
[H][C@@]12CC[C@@](O)(C#CC)[C@@]1(C)C[C@@H](C1=C3CCC(=O)C=C3CC[C@@]21[H])c1ccc(cc1)N(C)C
: