Target
Disintegrin and metalloproteinase domain-containing protein 10
Ligand
BDBM50367253
Substrate
Meas. Tech.
ChEMBL_1735799 (CHEMBL4151335)
Ki
73±n/a nM
Citation
 Mahasenan, KVDing, DGao, MNguyen, TTSuckow, MASchroeder, VAWolter, WRChang, MMobashery, S In Search of Selectivity in Inhibition of ADAM10. ACS Med Chem Lett 9:708-713 (2018)  
Target
Name:
Disintegrin and metalloproteinase domain-containing protein 10
Synonyms:
ADA10_HUMAN Disintegrin and metalloproteinase domain-containing protein 10 (ADAM10) MADM
Type:
Enzyme
Mol. Mass.:
84160.93
Organism:
Homo sapiens (Human)
Description:
O14672
Residue:
748
  
Inhibitor
Name:
BDBM50367253
Synonyms:
CHEMBL4167357
Type:
Small organic molecule
Emp. Form.:
C24H33N3O5
Mol. Mass.:
443.5359
SMILES:
ONC(=O)[C@H]1C[C@@H](CC[C@@H]1C(=O)N1CCC(CC1)c1ccccc1)OC(=O)N1CCCC1
: