Target
Cholecystokinin receptor type A
Ligand
BDBM50016425
Substrate
Meas. Tech.
ChEBML_49396
Ki
0.930000±n/a nM
Citation
 Charpentier, BDor, ARoy, PEngland, PPham, HDurieux, CRoques, BP Synthesis and binding affinities of cyclic and related linear analogues of CCK8 selective for central receptors. J Med Chem 32:1184-90 (1989)  
Target
Name:
Cholecystokinin receptor type A
Synonyms:
CCK-A receptor CCK1-R CCKAR_CAVPO Cholecystokinin receptor type A | Cholecystokinin-1 receptor
Type:
Mol. Mass.:
48229.77
Organism:
Cavia porcellus
Description:
Residue:
430
  
Inhibitor
Name:
BDBM50016425
Synonyms:
(S)-3-{(S)-2-[(S)-2-(2-{(S)-2-[(S)-2-tert-Butoxycarbonylamino-3-(4-sulfooxy-phenyl)-propionylamino]-hexanoylamino}-acetylamino)-3-(1H-indol-3-yl)-propionylamino]-hexanoylamino}-N-((S)-1-carbamoyl-2-phenyl-ethyl)-succinamic acid 3-{2-[2-(2-{2-[2-tert-Butoxycarbonylamino-3-(4-sulfooxy-phenyl)-propionylamino]-hexanoylamino}-acetylamino)-3-(1H-indol-3-yl)-propionylamino]-hexanoylamino}-N-(1-carbamoyl-2-phenyl-ethyl)-succinamic acid CHEMBL384035
Type:
Small organic molecule
Emp. Form.:
C52H69N9O15S
Mol. Mass.:
1092.221
SMILES:
CCCC[C@H](NC(=O)[C@H](Cc1ccc(OS(O)(=O)=O)cc1)NC(=O)OC(C)(C)C)C(=O)NCC(=O)N[C@@H](Cc1c[nH]c2ccccc12)C(=O)N[C@@H](CCCC)C(=O)N[C@@H](CC(O)=O)C(=O)N[C@@H](Cc1ccccc1)C(N)=O
: