Target
Cyclin-A2/Cyclin-dependent kinase 2
Ligand
BDBM50368902
Substrate
Meas. Tech.
ChEMBL_1736240 (CHEMBL4151776)
IC50
110±n/a nM
Citation
 Hazlitt, RATeitz, TBonga, JDFang, JDiao, SIconaru, LYang, LGoktug, ANCurrier, DGChen, TRankovic, ZMin, JZuo, J Development of Second-Generation CDK2 Inhibitors for the Prevention of Cisplatin-Induced Hearing Loss. J Med Chem 61:7700-7709 (2018)  
Target
Name:
Cyclin-A2/Cyclin-dependent kinase 2
Synonyms:
CDK2-CyclinA CDK2/Cyclin A Cyclin A2/dependent kinase 2 Cyclin-Dependent Kinase 2 (CDK2A)
Type:
Protein Complex
Mol. Mass.:
Description:
Cdk2/Cyclin A kinase was purified from insect cells coinfected with Cyclin A/Cdk2 baculovirus.
Components:
This complex has 2 components.
Component 1
Name:
Cyclin-dependent kinase 2
Synonyms:
CDK2 CDK2_HUMAN Cell division protein kinase 2 Protein cereblon/Cyclin-dependent kinase 2 | p33 protein kinase
Type:
Enzyme Subunit
Mol. Mass.:
33938.17
Organism:
Homo sapiens (Human)
Description:
P24941
Residue:
298
  
Component 2
Name:
Cyclin-A2
Synonyms:
CCN1 CCNA1 CCNA2_HUMAN Cyclin-A
Type:
Enzyme Subunit
Mol. Mass.:
48550.19
Organism:
Homo sapiens (Human)
Description:
P20248
Residue:
432
  
Inhibitor
Name:
BDBM50368902
Synonyms:
CHEMBL497477
Type:
Small organic molecule
Emp. Form.:
C16H17ClFN5O2
Mol. Mass.:
365.79
SMILES:
Fc1cccc(Cl)c1C(=O)Nc1c[nH]nc1C(=O)NC1CCNCC1
: