Target
Cytochrome P450 2C9
Ligand
BDBM18627
Substrate
Meas. Tech.
ChEMBL_1736293 (CHEMBL4151829)
IC50
4900±n/a nM
Citation
 Rew, YDu, XEksterowicz, JZhou, HJahchan, NZhu, LYan, XKawai, HMcGee, LRMedina, JCHuang, TChen, CZavorotinskaya, TSutimantanapi, DWaszczuk, JJackson, EHuang, EYe, QFantin, VRSun, D Discovery of a Potent and Selective Steroidal Glucocorticoid Receptor Antagonist (ORIC-101). J Med Chem 61:7767-7784 (2018)  
Target
Name:
Cytochrome P450 2C9
Synonyms:
(R)-limonene 6-monooxygenase CP2C9_HUMAN CYP2C9 Cytochrome P450 2C9 (CYP2C9 ) P-450MP P450 PB-1 | S-mephenytoin 4-hydroxylase
Type:
Enzyme
Mol. Mass.:
55636.33
Organism:
Homo sapiens (Human)
Description:
P11712
Residue:
490
  
Inhibitor
Name:
BDBM18627
Synonyms:
(10S,11S,14S,15S,17R)-17-[4-(dimethylamino)phenyl]-14-hydroxy-15-methyl-14-(prop-1-yn-1-yl)tetracyclo[8.7.0.0^{2,7}.0^{11,15}]heptadeca-1,6-dien-5-one Mifepristone RU486 (tetramethyl-rhodamine conjugated)
Type:
Small organic molecule
Emp. Form.:
C29H35NO2
Mol. Mass.:
429.5937
SMILES:
[H][C@@]12CC[C@@](O)(C#CC)[C@@]1(C)C[C@@H](C1=C3CCC(=O)C=C3CC[C@@]21[H])c1ccc(cc1)N(C)C
: