Target
Adenosine receptor A1
Ligand
BDBM50369691
Substrate
Meas. Tech.
ChEMBL_1736930 (CHEMBL4152680)
Ki
2.8±n/a nM
Citation
 Lambertucci, CMarucci, GDal Ben, DBuccioni, MSpinaci, AKachler, SKlotz, KNVolpini, R New potent and selective A Eur J Med Chem 151:199-213 (2018)  
Target
Name:
Adenosine receptor A1
Synonyms:
A1 adenosine receptor (hA1) AA1R_HUMAN ADORA1 Adenosine A1-receptor Adenosine receptor A1 (hA1) | Adenosine transporter (AdT)
Type:
G Protein-Coupled Receptor (GPCR)
Mol. Mass.:
36520.92
Organism:
Homo sapiens (Human)
Description:
P30542
Residue:
326
  
Inhibitor
Name:
BDBM50369691
Synonyms:
CHEMBL4175366
Type:
Small organic molecule
Emp. Form.:
C17H19N5
Mol. Mass.:
293.3663
SMILES:
Cn1c(nc2c(NC3CCCC3)ncnc12)-c1ccccc1
: