Target
Dihydrofolate reductase
Ligand
BDBM50018473
Substrate
Meas. Tech.
ChEMBL_54421 (CHEMBL667179)
Ki
0.800000±n/a nM
Citation
 Roth, BTidwell, MYFerone, RBaccanari, DPSigel, CWDeAngelis, DElwell, LP 2,4-Diamino-5-benzylpyrimidines as antibacterial agents. 13. Some alkenyl derivatives with high in vitro activity against anaerobic organisms. J Med Chem 32:1949-58 (1989)  
Target
Name:
Dihydrofolate reductase
Synonyms:
Dihydrofolate reductase (F31V) | dfrA17
Type:
Mol. Mass.:
17532.46
Organism:
Escherichia coli
Description:
Residue:
157
  
Inhibitor
Name:
BDBM50018473
Synonyms:
2-Allyl-4-(2,4-diamino-pyrimidin-5-ylmethyl)-6-methoxy-phenol | CHEMBL59416
Type:
Small organic molecule
Emp. Form.:
C15H18N4O2
Mol. Mass.:
286.329
SMILES:
COc1cc(Cc2cnc(N)nc2N)cc(CC=C)c1O
: