Target
Toll-like receptor 4
Ligand
BDBM25759
Substrate
Meas. Tech.
ChEMBL_1739483 (CHEMBL4155233)
IC50
32220±n/a nM
Citation
 Xu, YChen, SCao, YZhou, PChen, ZCheng, K Discovery of novel small molecule TLR4 inhibitors as potent anti-inflammatory agents. Eur J Med Chem 154:253-266 (2018)  
Target
Name:
Toll-like receptor 4
Synonyms:
TLR4 TLR4_HUMAN
Type:
PROTEIN
Mol. Mass.:
95675.49
Organism:
Homo sapiens (Human)
Description:
ChEMBL_1436169
Residue:
839
  
Inhibitor
Name:
BDBM25759
Synonyms:
CHEMBL723 Coreg Eucardic | [3-(9H-carbazol-4-yloxy)-2-hydroxypropyl][2-(2-methoxyphenoxy)ethyl]amine
Type:
Small organic molecule
Emp. Form.:
C24H26N2O4
Mol. Mass.:
406.4742
SMILES:
COc1ccccc1OCCNCC(O)COc1cccc2[nH]c3ccccc3c12
: