Target
Adenosine receptor A1
Ligand
BDBM10847
Substrate
Meas. Tech.
ChEBML_28990
Ki
8500±n/a nM
Citation
 Schneller, SWIbay, ACChrist, WJBruns, RF Linear and proximal benzo-separated alkylated xanthines as adenosine-receptor antagonists. J Med Chem 32:2247-54 (1989)  
Target
Name:
Adenosine receptor A1
Synonyms:
AA1R_RAT ADENOSINE A1 high Adenosine A1 receptor (A1) Adenosine receptors A1 | Adora1
Type:
Protein
Mol. Mass.:
36704.13
Organism:
Rattus norvegicus (rat)
Description:
Residue:
326
  
Inhibitor
Name:
BDBM10847
Synonyms:
1,3-dimethyl-2,3,6,7-tetrahydro-1H-purine-2,6-dione Afonilum Aminophylline Cardophyllin Theophy-lline Theophylline (1,3-dimethylxanthine)
Type:
Small organic molecule
Emp. Form.:
C7H8N4O2
Mol. Mass.:
180.164
SMILES:
Cn1c2nc[nH]c2c(=O)n(C)c1=O
: