Target
Adenosine receptor A2a
Ligand
BDBM50449642
Substrate
Meas. Tech.
ChEMBL_1740322 (CHEMBL4156072)
Ki
2.2±n/a nM
Citation
 Varano, FCatarzi, DVincenzi, FFalsini, MPasquini, SBorea, PAColotta, VVarani, K Structure-activity relationship studies and pharmacological characterization of N Eur J Med Chem 155:552-561 (2018)  
Target
Name:
Adenosine receptor A2a
Synonyms:
A2A adenosine receptor (hA2A) ADENOSINE A2 ADORA2 Adenosine A2A receptor (A2AAR)
Type:
G Protein-Coupled Receptor (GPCR)
Mol. Mass.:
44716.46
Organism:
Homo sapiens (Human)
Description:
P29274
Residue:
412
  
Inhibitor
Name:
BDBM50449642
Synonyms:
CHEMBL4167557
Type:
Small organic molecule
Emp. Form.:
C15H13N5O2S
Mol. Mass.:
327.361
SMILES:
Nc1nc(NCCc2ccco2)nc2sc(nc12)-c1ccco1
: