Target
Beta-secretase 1
Ligand
BDBM50012632
Substrate
Meas. Tech.
ChEMBL_1742007 (CHEMBL4157757)
IC50
173±n/a nM
Citation
 Martínez, AZahran, MGomez, MCooper, CGuevara, JEkengard, ENordlander, EAlcendor, RHambleton, S Novel multi-target compounds in the quest for new chemotherapies against Alzheimer's disease: An experimental and theoretical study. Bioorg Med Chem 26:4823-4840 (2018)  
Target
Name:
Beta-secretase 1
Synonyms:
ASP2 Aspartyl protease 2 BACE1 Beta-secretase (BACE) Beta-secretase 1 (BACE 1) Beta-secretase 1 (BACE1) Beta-site amyloid precursor protein cleaving enzyme 1 Memapsin-2 beta-Secretase (BACE-1) | beta-Secretase (BACE1)
Type:
Protein
Mol. Mass.:
55755.10
Organism:
Homo sapiens (Human)
Description:
P56817
Residue:
501
  
Inhibitor
Name:
BDBM50012632
Synonyms:
CHEMBL2333941
Type:
Small organic molecule
Emp. Form.:
C15H14F2N4S
Mol. Mass.:
320.36
SMILES:
C[C@]1(CCSC(N)=N1)c1cc(c(F)cc1F)-c1cncnc1
: