Target
Alpha-1A adrenergic receptor
Ligand
BDBM50018734
Substrate
Meas. Tech.
ChEBML_33091
Ki
24000±n/a nM
Citation
 Huff, JRBaldwin, JJdeSolms, SJGuare, JPHunt, CARandall, WCSanders, WSSmith, SJVacca, JPZrada, MM Structure-affinity relationships of arylquinolizines at alpha-adrenoceptors. J Med Chem 31:641-5 (1988)  
Target
Name:
Alpha-1A adrenergic receptor
Synonyms:
ADA1A_BOVIN ADRA1C Alpha 1A-adrenoreceptor Cerebral cortex alpha adrenergic receptor | adrenergic Alpha1
Type:
Enzyme Catalytic Domain
Mol. Mass.:
51492.08
Organism:
CALF
Description:
adrenergic Alpha1 0 CALF
Residue:
466
  
Inhibitor
Name:
BDBM50018734
Synonyms:
1,4,5,7,8,9,10,10a-Octahydro-pyrazolo[3,4-a]quinolizine | CHEMBL156283
Type:
Small organic molecule
Emp. Form.:
C10H15N3
Mol. Mass.:
177.2462
SMILES:
C1CCN2CCc3cn[nH]c3C2C1
: