Target
Alpha-2A adrenergic receptor
Ligand
BDBM50018737
Substrate
Meas. Tech.
ChEMBL_33030 (CHEMBL643955)
Ki
60±n/a nM
Citation
 Huff, JRBaldwin, JJdeSolms, SJGuare, JPHunt, CARandall, WCSanders, WSSmith, SJVacca, JPZrada, MM Structure-affinity relationships of arylquinolizines at alpha-adrenoceptors. J Med Chem 31:641-5 (1988)  
Target
Name:
Alpha-2A adrenergic receptor
Synonyms:
ADA2A_BOVIN Alpha-2A adrenergic receptor Alpha-2A adrenoreceptor Alpha-2D adrenergic receptor Cerebral cortex alpha adrenergic receptor adrenergic Alpha2D
Type:
Enzyme Catalytic Domain
Mol. Mass.:
49275.13
Organism:
BOVINE
Description:
adrenergic Alpha2 0 BOVINE::Q28838
Residue:
452
  
Inhibitor
Name:
BDBM50018737
Synonyms:
1,2,3,4,6,7,12,12b-Octahydro-indolo[2,3-a]quinolizine CHEMBL345349
Type:
Small organic molecule
Emp. Form.:
C15H18N2
Mol. Mass.:
226.3168
SMILES:
C1CCN2CCc3c([nH]c4ccccc34)C2C1
: