Target
Alpha-1A adrenergic receptor
Ligand
BDBM50018741
Substrate
Meas. Tech.
ChEMBL_33091 (CHEMBL643583)
Ki
1100±n/a nM
Citation
 Huff, JRBaldwin, JJdeSolms, SJGuare, JPHunt, CARandall, WCSanders, WSSmith, SJVacca, JPZrada, MM Structure-affinity relationships of arylquinolizines at alpha-adrenoceptors. J Med Chem 31:641-5 (1988)  
Target
Name:
Alpha-1A adrenergic receptor
Synonyms:
ADA1A_BOVIN ADRA1C Alpha 1A-adrenoreceptor Cerebral cortex alpha adrenergic receptor | adrenergic Alpha1
Type:
Enzyme Catalytic Domain
Mol. Mass.:
51492.08
Organism:
CALF
Description:
adrenergic Alpha1 0 CALF
Residue:
466
  
Inhibitor
Name:
BDBM50018741
Synonyms:
4,7,8,9,10,10a-Hexahydro-5H-thieno[2,3-a]quinolizine | CHEMBL346016
Type:
Small organic molecule
Emp. Form.:
C11H15NS
Mol. Mass.:
193.309
SMILES:
C1CCN2CCc3ccsc3C2C1
: