Target
Alpha-1A adrenergic receptor
Ligand
BDBM50018739
Substrate
Meas. Tech.
ChEMBL_33103 (CHEMBL645956)
Ki
16±n/a nM
Citation
 Huff, JRBaldwin, JJdeSolms, SJGuare, JPHunt, CARandall, WCSanders, WSSmith, SJVacca, JPZrada, MM Structure-affinity relationships of arylquinolizines at alpha-adrenoceptors. J Med Chem 31:641-5 (1988)  
Target
Name:
Alpha-1A adrenergic receptor
Synonyms:
ADA1A_BOVIN ADRA1C Alpha 1A-adrenoreceptor Cerebral cortex alpha adrenergic receptor | adrenergic Alpha1
Type:
Enzyme Catalytic Domain
Mol. Mass.:
51492.08
Organism:
CALF
Description:
adrenergic Alpha1 0 CALF
Residue:
466
  
Inhibitor
Name:
BDBM50018739
Synonyms:
1,3,4,5,6,11b-Hexahydro-2H-11-thia-4a-aza-benzo[a]fluorene | CHEMBL346492
Type:
Small organic molecule
Emp. Form.:
C15H17NS
Mol. Mass.:
243.367
SMILES:
C1CCN2CCc3c(sc4ccccc34)C2C1
: