Target
Transient receptor potential cation channel subfamily V member 4
Ligand
BDBM50450511
Substrate
Meas. Tech.
ChEMBL_1742691 (CHEMBL4158441)
IC50
50±n/a nM
Citation
 Brnardic, EJYe, GBrooks, CDonatelli, CBarton, LMcAtee, JSanchez, RMShu, AErhard, KTerrell, LGraczyk-Millbrandt, GHe, YCostell, MHBehm, DJRoethke, TStoy, PHolt, DALawhorn, BG Discovery of Pyrrolidine Sulfonamides as Selective and Orally Bioavailable Antagonists of Transient Receptor Potential Vanilloid-4 (TRPV4). J Med Chem 61:9738-9755 (2018)  
Target
Name:
Transient receptor potential cation channel subfamily V member 4
Synonyms:
TRPV4 Transient receptor potential cation channel subfamily V member 4 (TRPV4) VROAC
Type:
Enzyme
Mol. Mass.:
98290.10
Organism:
Homo sapiens (Human)
Description:
Q9HBA0
Residue:
871
  
Inhibitor
Name:
BDBM50450511
Synonyms:
CHEMBL4165555
Type:
Small organic molecule
Emp. Form.:
C18H15Cl2FN2O4S
Mol. Mass.:
445.292
SMILES:
OC[C@@H]1CN(C[C@@H]1Oc1ccc(C#N)c(F)c1)S(=O)(=O)c1ccc(Cl)cc1Cl
: