Target
Sigma intracellular receptor 2
Ligand
BDBM50048866
Substrate
Meas. Tech.
ChEMBL_1742999 (CHEMBL4158749)
Ki
0.680000±n/a nM
Citation
 Bergkemper, MKronenberg, EThum, SBörgel, FDaniliuc, CSchepmann, DNieto, FRBrust, PReinoso, RFAlvarez, IWünsch, B Synthesis, Receptor Affinity, and Antiallodynic Activity of Spirocyclic ? Receptor Ligands with Exocyclic Amino Moiety. J Med Chem 61:9666-9690 (2018)  
Target
Name:
Sigma intracellular receptor 2
Synonyms:
S2r Sigma intracellular receptor 2 Sigma2 receptor Transmembrane protein 97
Type:
Protein
Mol. Mass.:
20953.88
Organism:
Rattus norvegicus (Rat)
Description:
Q5U3Y7
Residue:
176
  
Inhibitor
Name:
BDBM50048866
Synonyms:
1-Cyclohexyl-4-[3-(5-methoxy-1,2,3,4-tetrahydro-naphthalen-1-yl)-propyl]-piperazine 1-cyclohexyl-4-[3-(5-methoxy-1,2,3,4-tetrahydro-naphthalen-1-yl)propyl]piperazine CHEMBL53325 | PB-28
Type:
Small organic molecule
Emp. Form.:
C24H38N2O
Mol. Mass.:
370.5713
SMILES:
COc1cccc2C(CCCN3CCN(CC3)C3CCCCC3)CCCc12
: