Target
Alpha-mannosidase
Ligand
BDBM50242271
Substrate
Meas. Tech.
ChEMBL_1746128 (CHEMBL4180638)
IC50
75880±n/a nM
Citation
 Lawande, PPSontakke, VAKumbhar, NMBhagwat, TRGhosh, SShinde, VS Polyhydroxylated azetidine iminosugars: Synthesis, glycosidase inhibitory activity and molecular docking studies. Bioorg Med Chem Lett 27:5291-5295 (2017)  
Target
Name:
Alpha-mannosidase
Synonyms:
Alpha-mannosidase Alpha-mannosidase, light subunit Jbalpha-man | MANA_CANEN
Type:
PROTEIN
Mol. Mass.:
108565.93
Organism:
Canavalia ensiformis
Description:
ChEMBL_109557
Residue:
959
  
Inhibitor
Name:
BDBM50242271
Synonyms:
(2R,3R,4R,5S)-1-(2-hydroxyethyl)-2-(hydroxymethyl)piperidine-3,4,5-triol BAY-M-1099 Glyset N-Hydroxyethyl-1-deoxynojirimycin | cid_441314
Type:
Small organic molecule
Emp. Form.:
C8H17NO5
Mol. Mass.:
207.2243
SMILES:
OCCN1C[C@H](O)[C@@H](O)[C@H](O)[C@H]1CO
: